{"text_format":"1","workbook":"xlsx","n_sheets":7,"sheets":["Conversione","Unità","LDR R-06-05 radiologia","LDR R-06-05 cardiologia","LDR R-06-05 gastroenterologia","LDR R-06-05 urologia","LDR R-06-04 radiol. proiettiva"],"not_rendered":{"charts":0,"images":14,"macros":1,"external_links":0,"defined_names":0,"comments":0,"pivot_tables":0},"unopened":[],"bounds":{"document_bytes":16777216,"sheet_cells":100000,"rows_first":2000,"rows_last":500,"rows_between":2000,"halvings":0,"cell_chars":16384,"cell_head_chars":4096},"cells_cut":0,"cells_raw":0,"read":"whole","date_system":"1900"}

{"sheet":"Conversione","index":0,"n_rows":22,"n_cols":8,"rows_kept":22,"cut":false,"hidden":false,"merged":[]}
[null,"Ufficio federale de la sanità pubblica, Div. Radioprotezione"]
[null,null,"Conversione prodotti dose-superficie"]
[]
[null,null,"PDS:",null,"Unità:",">>","Conversione:"]
[]
[null,null,null,null,1,"=",{"$f":"IF($E$6=1,(VLOOKUP($E$6,Unità!B5:F5,1)*C6),IF($E$6=2,(VLOOKUP(E6,Unità!B6:F6,1)*$C$6),IF($E$6=3,(VLOOKUP(E6,Unità!B7:F7,1)*$C$6),IF($E$6=4,(VLOOKUP(E6,Unità!B8:F8,1)*$C$6),(VLOOKUP(E6,Unità!B9:F9,1)*$C$6)))))","v":0},"Gy · cm2"]
[]
[null,null,null,null,null,"=",{"$f":"IF($E$6=1,(VLOOKUP($E$6,Unità!B5:F5,2)*$C$6),IF($E$6=2,(VLOOKUP(E6,Unità!B6:F6,2)*$C$6),IF($E$6=3,(VLOOKUP($E6,Unità!B7:F7,2)*$C$6),IF($E$6=4,(VLOOKUP($E$6,Unità!B8:F8,2)*$C$6),(VLOOKUP($E$6,Unità!B9:F9,2)*$C$6)))))","v":0},"dGy · cm2"]
[]
[null,null,null,null,null,"=",{"$f":"IF($E$6=1,(VLOOKUP($E$6,Unità!B5:F5,3)*$C$6),IF($E$6=2,(VLOOKUP($E$6,Unità!B6:F6,3)*$C$6),IF($E$6=3,(VLOOKUP($E$6,Unità!B7:F7,3)*$C$6),IF($E$6=4,(VLOOKUP($E$6,Unità!B8:F8,3)*$C$6),(VLOOKUP($E$6,Unità!B9:F9,3)*$C$6)))))","v":0},"cGy · cm2"]
[]
[null,null,null,null,null,"=",{"$f":"IF($E$6=1,(VLOOKUP($E$6,Unità!B5:F5,4)*$C$6),IF($E$6=2,(VLOOKUP($E$6,Unità!B6:F6,4)*$C$6),IF($E$6=3,(VLOOKUP($E$6,Unità!B7:F7,4)*$C$6),IF($E$6=4,(VLOOKUP($E$6,Unità!B8:F8,4)*$C$6),(VLOOKUP($E$6,Unità!B9:F9,4)*$C$6)))))","v":0},"μGy · m2"]
[]
[null,null,null,null,null,"=",{"$f":"IF($E$6=1,(VLOOKUP($E$6,Unità!B5:F5,5)*$C$6),IF($E$6=2,(VLOOKUP($E$6,Unità!B6:F6,5)*$C$6),IF($E$6=3,(VLOOKUP($E$6,Unità!B7:F7,5)*$C$6),IF($E$6=4,(VLOOKUP($E$6,Unità!B8:F8,5)*$C$6),(VLOOKUP($E$6,Unità!B9:F9,5)*$C$6)))))","v":0},"mGy · cm2"]
[null,"V2.1 © 07.2022 UFSP"]
[]
[null,"Destinazione d’uso:"]
[null,"Il tool PDSConvert facilita ai titolari di licenze la conversione dell’"]
[null,"unità del prodotto dose-superficie nel contesto del confronto degli"]
[null,"LDR e non deve essere utilizzato in un contesto d’esame."]
[null,"Negli impianti a raggi X il prodotto dose-superficie viene visualizzato "]
[null,"soltanto durante o dopo un esame."]

{"sheet":"Unità","index":1,"n_rows":10,"n_cols":6,"rows_kept":10,"cut":false,"hidden":false,"merged":[]}
["Ufficio federale de la sanità pubblica, Div. Radioprotezione"]
["Conversione prodotti dose-superficie"]
[]
["Unità","Gy · cm2","dGy · cm2","cGy · cm2","μGy · m2","mGy · cm2"]
["Gy · cm2",1,10,100,100,1000]
["dGy · cm2",0.1,1,10,10,100]
["cGy · cm2",0.01,0.1,1,1,10]
["μGy · m2",0.01,0.1,1,1,10]
["mGy · cm2",1E-3,0.01,0.1,0.1,1]
["V2.1 © 07.2022 UFSP"]

{"sheet":"LDR R-06-05 radiologia","index":2,"n_rows":2,"n_cols":11,"rows_kept":2,"cut":false,"hidden":false,"merged":[]}
["Ufficio federale de la sanità pubblica, Div. Radioprotezione"]
[null,null,null,null,null,null,null,null,null,null,"Guida UFSP R-06-05"]

{"sheet":"LDR R-06-05 cardiologia","index":3,"n_rows":2,"n_cols":11,"rows_kept":2,"cut":false,"hidden":false,"merged":[]}
["Ufficio federale de la sanità pubblica, Div. Radioprotezione"]
[null,null,null,null,null,null,null,null,null,null,"Guida UFSP R-06-05"]

{"sheet":"LDR R-06-05 gastroenterologia","index":4,"n_rows":2,"n_cols":11,"rows_kept":2,"cut":false,"hidden":false,"merged":[]}
["Ufficio federale de la sanità pubblica, Div. Radioprotezione"]
[null,null,null,null,null,null,null,null,null,null,"Guida UFSP R-06-05"]

{"sheet":"LDR R-06-05 urologia","index":5,"n_rows":2,"n_cols":11,"rows_kept":2,"cut":false,"hidden":false,"merged":[]}
["Ufficio federale de la sanità pubblica, Div. Radioprotezione"]
[null,null,null,null,null,null,null,null,null,null,"Guida UFSP R-06-05"]

{"sheet":"LDR R-06-04 radiol. proiettiva","index":6,"n_rows":2,"n_cols":11,"rows_kept":2,"cut":false,"hidden":false,"merged":[]}
["Ufficio federale de la sanità pubblica, Div. Radioprotezione"]
[null,null,null,null,null,null,null,null,null,null,"Guida UFSP R-06-04"]