{"text_format":"1","workbook":"xlsx","n_sheets":7,"sheets":["Konversion","Einheiten","DRW R-06-05 Radiologie","DRW R-06-05 Kardiologie","DRW R-06-05 Gastro-Enterologie","DRW R-06-05 Urologie","DRW R-06-04 Projektionsradiol."],"not_rendered":{"charts":0,"images":12,"macros":1,"external_links":0,"defined_names":0,"comments":0,"pivot_tables":0},"unopened":[],"bounds":{"document_bytes":16777216,"sheet_cells":100000,"rows_first":2000,"rows_last":500,"rows_between":2000,"halvings":0,"cell_chars":16384,"cell_head_chars":4096},"cells_cut":0,"cells_raw":0,"read":"whole","date_system":"1900"}

{"sheet":"Konversion","index":0,"n_rows":22,"n_cols":8,"rows_kept":22,"cut":false,"hidden":false,"merged":[]}
[null,"Bundesamt für Gesundheit, Abt. Strahlenschutz"]
[null,null,"Umrechnung Dosis-Flächenprodukte"]
[]
[null,null,"DFP:",null,"Einheit:",">>","Konversion:"]
[]
[null,null,null,null,1,"=",{"$f":"IF($E$6=1,(VLOOKUP($E$6,Einheiten!B5:F5,1)*C6),IF($E$6=2,(VLOOKUP(E6,Einheiten!B6:F6,1)*$C$6),IF($E$6=3,(VLOOKUP(E6,Einheiten!B7:F7,1)*$C$6),IF($E$6=4,(VLOOKUP(E6,Einheiten!B8:F8,1)*$C$6),(VLOOKUP(E6,Einheiten!B9:F9,1)*$C$6)))))","v":0},"Gy · cm2"]
[]
[null,null,null,null,null,"=",{"$f":"IF($E$6=1,(VLOOKUP($E$6,Einheiten!B5:F5,2)*$C$6),IF($E$6=2,(VLOOKUP(E6,Einheiten!B6:F6,2)*$C$6),IF($E$6=3,(VLOOKUP($E6,Einheiten!B7:F7,2)*$C$6),IF($E$6=4,(VLOOKUP($E$6,Einheiten!B8:F8,2)*$C$6),(VLOOKUP($E$6,Einheiten!B9:F9,2)*$C$6)))))","v":0},"dGy · cm2"]
[]
[null,null,null,null,null,"=",{"$f":"IF($E$6=1,(VLOOKUP($E$6,Einheiten!B5:F5,3)*$C$6),IF($E$6=2,(VLOOKUP($E$6,Einheiten!B6:F6,3)*$C$6),IF($E$6=3,(VLOOKUP($E$6,Einheiten!B7:F7,3)*$C$6),IF($E$6=4,(VLOOKUP($E$6,Einheiten!B8:F8,3)*$C$6),(VLOOKUP($E$6,Einheiten!B9:F9,3)*$C$6)))))","v":0},"cGy · cm2"]
[]
[null,null,null,null,null,"=",{"$f":"IF($E$6=1,(VLOOKUP($E$6,Einheiten!B5:F5,4)*$C$6),IF($E$6=2,(VLOOKUP($E$6,Einheiten!B6:F6,4)*$C$6),IF($E$6=3,(VLOOKUP($E$6,Einheiten!B7:F7,4)*$C$6),IF($E$6=4,(VLOOKUP($E$6,Einheiten!B8:F8,4)*$C$6),(VLOOKUP($E$6,Einheiten!B9:F9,4)*$C$6)))))","v":0},"μGy · m2"]
[]
[null,null,null,null,null,"=",{"$f":"IF($E$6=1,(VLOOKUP($E$6,Einheiten!B5:F5,5)*$C$6),IF($E$6=2,(VLOOKUP($E$6,Einheiten!B6:F6,5)*$C$6),IF($E$6=3,(VLOOKUP($E$6,Einheiten!B7:F7,5)*$C$6),IF($E$6=4,(VLOOKUP($E$6,Einheiten!B8:F8,5)*$C$6),(VLOOKUP($E$6,Einheiten!B9:F9,5)*$C$6)))))","v":0},"mGy · cm2"]
[null,"V2.1 © 07.2022 BAG"]
[]
[null,"Zweckbestimmung:"]
[null,"Das Tool DFPConvert unterstützt Bewilligungsinhaber/-innen bei der "]
[null,"Umrechnung der Einheit des Dosis-Flächenprodukts im Kontext des"]
[null,"DRW-Vergleichs und ist nicht im Untersuchungskontext zu verwenden."]
[null,"Das Dosis-Flächenprodukt wird an den Röntgensystemen erst"]
[null,"während, bzw. nach einer Untersuchung angezeigt."]

{"sheet":"Einheiten","index":1,"n_rows":10,"n_cols":6,"rows_kept":10,"cut":false,"hidden":false,"merged":[]}
["Bundesamt für Gesundheit, Abt. Strahlenschutz"]
["Umrechnung Dosis-Flächenprodukte"]
[]
["Einheit","Gy · cm2","dGy · cm2","cGy · cm2","μGy · m2","mGy · cm2"]
["Gy · cm2",1,10,100,100,1000]
["dGy · cm2",0.1,1,10,10,100]
["cGy · cm2",0.01,0.1,1,1,10]
["μGy · m2",0.01,0.1,1,1,10]
["mGy · cm2",1E-3,0.01,0.1,0.1,1]
["V2.1 © 07.2022 BAG"]

{"sheet":"DRW R-06-05 Radiologie","index":2,"n_rows":2,"n_cols":11,"rows_kept":2,"cut":false,"hidden":false,"merged":[]}
["Bundesamt für Gesundheit, Abt. Strahlenschutz"]
[null,null,null,null,null,null,null,null,null,null,"BAG-Wegleitung R-06-05"]

{"sheet":"DRW R-06-05 Kardiologie","index":3,"n_rows":2,"n_cols":11,"rows_kept":2,"cut":false,"hidden":false,"merged":[]}
["Bundesamt für Gesundheit, Abt. Strahlenschutz"]
[null,null,null,null,null,null,null,null,null,null,"BAG-Wegleitung R-06-05"]

{"sheet":"DRW R-06-05 Gastro-Enterologie","index":4,"n_rows":2,"n_cols":11,"rows_kept":2,"cut":false,"hidden":false,"merged":[]}
["Bundesamt für Gesundheit, Abt. Strahlenschutz"]
[null,null,null,null,null,null,null,null,null,null,"BAG-Wegleitung R-06-05"]

{"sheet":"DRW R-06-05 Urologie","index":5,"n_rows":2,"n_cols":11,"rows_kept":2,"cut":false,"hidden":false,"merged":[]}
["Bundesamt für Gesundheit, Abt. Strahlenschutz"]
[null,null,null,null,null,null,null,null,null,null,"BAG-Wegleitung R-06-05"]

{"sheet":"DRW R-06-04 Projektionsradiol.","index":6,"n_rows":2,"n_cols":11,"rows_kept":2,"cut":false,"hidden":false,"merged":[]}
["Bundesamt für Gesundheit, Abt. Strahlenschutz"]
[null,null,null,null,null,null,null,null,null,null,"BAG-Wegleitung R-06-04"]